Reaction Details
TargetPotassium channel subfamily K member 2
LigandBDBM50180656
Substrate/Competitorn/a
Meas. Tech.ChEMBL_1584396 (CHEMBL3819817)
EC50 9700±n/a nM
Citation Vivier, DBennis, KLesage, FDucki, S Perspectives on the Two-Pore Domain Potassium Channel TREK-1 (TWIK-Related K(+) Channel 1). A Novel Therapeutic Target? J Med Chem59:5149-57 (2016) 
 
Potassium channel subfamily K member 2
Name:Potassium channel subfamily K member 2
Type:Protein
Mol. Mass.:47099.16
Organism:Homo sapiens (Human)
Description:O95069
Residue:426
BDBM50180656
NameBDBM50180656
Synonyms:CHEMBL3818503
TypeSmall organic molecule
Emp. Form.C18H17Cl2N5
Mol. Mass.374.267
SMILESCC1(C)c2cc(Cl)ccc2N(CCc2nnn[nH]2)c2ccc(Cl)cc12