Reaction Details
TargetPotassium channel subfamily K member 2
LigandBDBM50180658
Substrate/Competitorn/a
Meas. Tech.ChEMBL_1584395 (CHEMBL3819816)
EC50 213000±n/a nM
Citation Vivier, DBennis, KLesage, FDucki, S Perspectives on the Two-Pore Domain Potassium Channel TREK-1 (TWIK-Related K(+) Channel 1). A Novel Therapeutic Target? J Med Chem59:5149-57 (2016) 
 
Potassium channel subfamily K member 2
Name:Potassium channel subfamily K member 2
Type:Protein
Mol. Mass.:47099.16
Organism:Homo sapiens (Human)
Description:O95069
Residue:426
BDBM50180658
NameBDBM50180658
Synonyms:CHEMBL3818800
TypeSmall organic molecule
Emp. Form.C15H11Cl2NO2
Mol. Mass.308.159
SMILESOC(=O)CCn1c2ccc(Cl)cc2c2cc(Cl)ccc12