Reaction Details
TargetPotassium two pore domain channel subfamily K member 2
LigandBDBM50017702
Substrate/Competitorn/a
Meas. Tech.ChEMBL_1584412 (CHEMBL3819955)
IC50 2500±n/a nM
Citation Vivier, DBennis, KLesage, FDucki, S Perspectives on the Two-Pore Domain Potassium Channel TREK-1 (TWIK-Related K(+) Channel 1). A Novel Therapeutic Target? J Med Chem59:5149-57 (2016) 
 
Potassium two pore domain channel subfamily K member 2
Name:Potassium two pore domain channel subfamily K member 2
Synonyms:Potassium channel subfamily K member 2
Type:PROTEIN
Mol. Mass.:45443.30
Organism:Bos taurus
Description:ChEMBL_620769
Residue:411
BDBM50017702
NameBDBM50017702
TypeSmall organic molecule
Emp. Form.C26H26F2N2
Mol. Mass.404.4948
SMILESFc1ccc(cc1)C(N1CCN(C\C=C\c2ccccc2)CC1)c1ccc(F)cc1