Reaction Details
TargetAndrogen receptor
LigandBDBM50180795
Substrate/Competitorn/a
Meas. Tech.ChEMBL_1584566 (CHEMBL3820557)
EC50 16±n/a nM
Citation Handlon, ALSchaller, LTLeesnitzer, LMMerrihew, RVPoole, CUlrich, JCWilson, JWCadilla, RTurnbull, P Optimizing Ligand Efficiency of Selective Androgen Receptor Modulators (SARMs). ACS Med Chem Lett7:83-8 (2016) 
 
Androgen receptor
Name:Androgen receptor
Type:Receptor
Mol. Mass.:99185.27
Organism:Homo sapiens (Human)
Description:CHO cells were stably transfected with human AR gene.
Residue:920
BDBM50180795
NameBDBM50180795
Synonyms:CHEMBL3818069
TypeSmall organic molecule
Emp. Form.C15H11ClF3NO
Mol. Mass.313.702
SMILESCc1c(Cl)c(ccc1C(O)(C#CC1CC1)C(F)(F)F)C#N