Reaction Details
TargetAndrogen receptor
LigandBDBM50180797
Substrate/Competitorn/a
Meas. Tech.ChEMBL_1584566 (CHEMBL3820557)
EC50 4.0±n/a nM
Citation Handlon, ALSchaller, LTLeesnitzer, LMMerrihew, RVPoole, CUlrich, JCWilson, JWCadilla, RTurnbull, P Optimizing Ligand Efficiency of Selective Androgen Receptor Modulators (SARMs). ACS Med Chem Lett7:83-8 (2016) 
 
Androgen receptor
Name:Androgen receptor
Type:Receptor
Mol. Mass.:99185.27
Organism:Homo sapiens (Human)
Description:CHO cells were stably transfected with human AR gene.
Residue:920
BDBM50180797
NameBDBM50180797
Synonyms:CHEMBL3818688
TypeSmall organic molecule
Emp. Form.C15H17ClF3NO
Mol. Mass.319.75
SMILESCc1c(Cl)c(ccc1C(O)(CC(C)(C)C)C(F)(F)F)C#N