Reaction Details
TargetAndrogen receptor
LigandBDBM50180803
Substrate/Competitorn/a
Meas. Tech.ChEMBL_1584566 (CHEMBL3820557)
EC50 3.2±n/a nM
Citation Handlon, ALSchaller, LTLeesnitzer, LMMerrihew, RVPoole, CUlrich, JCWilson, JWCadilla, RTurnbull, P Optimizing Ligand Efficiency of Selective Androgen Receptor Modulators (SARMs). ACS Med Chem Lett7:83-8 (2016) 
 
Androgen receptor
Name:Androgen receptor
Type:Receptor
Mol. Mass.:99185.27
Organism:Homo sapiens (Human)
Description:CHO cells were stably transfected with human AR gene.
Residue:920
BDBM50180803
NameBDBM50180803
Synonyms:CHEMBL3818919
TypeSmall organic molecule
Emp. Form.C14H14Cl2F3NO
Mol. Mass.340.168
SMILESCC(C)(C)CC(O)(c1ccc(C#N)c(Cl)c1Cl)C(F)(F)F