Reaction Details
TargetAndrogen receptor
LigandBDBM50180809
Substrate/Competitorn/a
Meas. Tech.ChEMBL_1584566 (CHEMBL3820557)
EC50 63±n/a nM
Citation Handlon, ALSchaller, LTLeesnitzer, LMMerrihew, RVPoole, CUlrich, JCWilson, JWCadilla, RTurnbull, P Optimizing Ligand Efficiency of Selective Androgen Receptor Modulators (SARMs). ACS Med Chem Lett7:83-8 (2016) 
 
Androgen receptor
Name:Androgen receptor
Type:Receptor
Mol. Mass.:99185.27
Organism:Homo sapiens (Human)
Description:CHO cells were stably transfected with human AR gene.
Residue:920
BDBM50180809
NameBDBM50180809
Synonyms:CHEMBL3818405
TypeSmall organic molecule
Emp. Form.C10H6Cl2F3NO
Mol. Mass.284.062
SMILESCC(O)(c1ccc(C#N)c(Cl)c1Cl)C(F)(F)F