Reaction Details
TargetAndrogen receptor
LigandBDBM50180816
Substrate/Competitorn/a
Meas. Tech.ChEMBL_1584566 (CHEMBL3820557)
EC50 1.6±n/a nM
Citation Handlon, ALSchaller, LTLeesnitzer, LMMerrihew, RVPoole, CUlrich, JCWilson, JWCadilla, RTurnbull, P Optimizing Ligand Efficiency of Selective Androgen Receptor Modulators (SARMs). ACS Med Chem Lett7:83-8 (2016) 
 
Androgen receptor
Name:Androgen receptor
Type:Receptor
Mol. Mass.:99185.27
Organism:Homo sapiens (Human)
Description:CHO cells were stably transfected with human AR gene.
Residue:920
BDBM50180816
NameBDBM50180816
Synonyms:CHEMBL3818854
TypeSmall organic molecule
Emp. Form.C14H14F3NO
Mol. Mass.269.2623
SMILESCc1c(C)c(ccc1C#N)C(O)(C1CC1)C(F)(F)F