Reaction Details
TargetAndrogen receptor
LigandBDBM50180819
Substrate/Competitorn/a
Meas. Tech.ChEMBL_1584566 (CHEMBL3820557)
EC50 40±n/a nM
Citation Handlon, ALSchaller, LTLeesnitzer, LMMerrihew, RVPoole, CUlrich, JCWilson, JWCadilla, RTurnbull, P Optimizing Ligand Efficiency of Selective Androgen Receptor Modulators (SARMs). ACS Med Chem Lett7:83-8 (2016) 
 
Androgen receptor
Name:Androgen receptor
Type:Receptor
Mol. Mass.:99185.27
Organism:Homo sapiens (Human)
Description:CHO cells were stably transfected with human AR gene.
Residue:920
BDBM50180819
NameBDBM50180819
Synonyms:CHEMBL3817997
TypeSmall organic molecule
Emp. Form.C14H11F6NO
Mol. Mass.323.2337
SMILESC\C=C(/C)C(O)(c1ccc(C#N)c(c1)C(F)(F)F)C(F)(F)F