Reaction Details
TargetAndrogen receptor
LigandBDBM50180831
Substrate/Competitorn/a
Meas. Tech.ChEMBL_1584566 (CHEMBL3820557)
EC50 1.6±n/a nM
Citation Handlon, ALSchaller, LTLeesnitzer, LMMerrihew, RVPoole, CUlrich, JCWilson, JWCadilla, RTurnbull, P Optimizing Ligand Efficiency of Selective Androgen Receptor Modulators (SARMs). ACS Med Chem Lett7:83-8 (2016) 
 
Androgen receptor
Name:Androgen receptor
Type:Receptor
Mol. Mass.:99185.27
Organism:Homo sapiens (Human)
Description:CHO cells were stably transfected with human AR gene.
Residue:920
BDBM50180831
NameBDBM50180831
Synonyms:CHEMBL3818542
TypeSmall organic molecule
Emp. Form.C12H6F9NO
Mol. Mass.351.1678
SMILESCc1c(ccc(C#N)c1C(F)(F)F)C(O)(C(F)(F)F)C(F)(F)F