Reaction Details
TargetDual specificity mitogen-activated protein kinase kinase 1
LigandBDBM50180839
Substrate/Competitorn/a
Meas. Tech.ChEMBL_1584573 (CHEMBL3820564)
IC50 20±n/a nM
Citation Van Dort, MEHong, HWang, HNino, CALombardi, RLBlanks, AEGalbán, SRoss, BD Discovery of Bifunctional Oncogenic Target Inhibitors against Allosteric Mitogen-Activated Protein Kinase (MEK1) and Phosphatidylinositol 3-Kinase (PI3K). J Med Chem59:2512-22 (2016) 
 
Dual specificity mitogen-activated protein kinase kinase 1
Name:Dual specificity mitogen-activated protein kinase kinase 1
Type:PROTEIN
Mol. Mass.:43474.56
Organism:Mus musculus
Description:ChEMBL_506739
Residue:393
BDBM50180839
NameBDBM50180839
Synonyms:CHEMBL1998165
TypeSmall organic molecule
Emp. Form.C16H15F3IN3O2
Mol. Mass.465.2089
SMILESCNCCONC(=O)c1ccc(F)c(F)c1Nc1ccc(I)cc1F