Reaction Details
TargetProstaglandin G/H synthase 1
LigandBDBM26197
Substrate/Competitorn/a
Meas. Tech.ChEMBL_1584966 (CHEMBL3819990)
IC50 200000±n/a nM
Citation Ehrt, CBrinkjost, TKoch, O Impact of Binding Site Comparisons on Medicinal Chemistry and Rational Molecular Design. J Med Chem59:4121-51 (2016) 
 
Prostaglandin G/H synthase 1
Name:Prostaglandin G/H synthase 1
Type:Enzyme
Mol. Mass.:68692.62
Organism:Homo sapiens (Human)
Description:P23219
Residue:599
BDBM26197
NameBDBM26197
Synonyms:CHEMBL112 Norco US9333197, Acetaminophen phenol derivative, 11
TypeSmall organic molecule
Emp. Form.C8H9NO2
Mol. Mass.151.1626
SMILESCC(=O)Nc1ccc(O)cc1