Reaction Details
TargetNitric oxide synthase, brain
LigandBDBM190667
Substrate/Competitorn/a
Meas. Tech.ChEMBL_1585062 (CHEMBL3820407)
IC50 142±n/a nM
Citation Wang, HYQin, YLi, HRoman, LJMartásek, PPoulos, TLSilverman, RB Potent and Selective Human Neuronal Nitric Oxide Synthase Inhibition by Optimization of the 2-Aminopyridine-Based Scaffold with a Pyridine Linker. J Med Chem59:4913-25 (2016) 
 
Nitric oxide synthase, brain
Name:Nitric oxide synthase, brain
Type:Enzyme
Mol. Mass.:160570.98
Organism:Rattus norvegicus (rat)
Description:Recombinant nNOS overexpressed in E. coli was used in enzyme assays.
Residue:1429
BDBM190667
NameBDBM190667
Synonyms:US10759791, Compound 14j | nNOS inhibitor, 5
TypeSmall organic molecule
Emp. Form.C17H24N4
Mol. Mass.284.3993
SMILESCNCCCc1cncc(CCc2cc(C)cc(N)n2)c1