Reaction Details
Target2-amino-4-hydroxy-6-hydroxymethyldihydropteridine pyrophosphokinase
LigandBDBM50181516
Substrate/Competitorn/a
Meas. Tech.ChEBML_1585632
Kd 68000±n/a nM
Citation Dennis, MLPitcher, NPLee, MDDeBono, AJWang, ZCHarjani, JRRahmani, RCleary, BPeat, TSBaell, JBSwarbrick, JD Structural Basis for the Selective Binding of Inhibitors to 6-Hydroxymethyl-7,8-dihydropterin Pyrophosphokinase from Staphylococcus aureus and Escherichia coli. J Med Chem59:5248-63 (2016) 
 
2-amino-4-hydroxy-6-hydroxymethyldihydropteridine pyrophosphokinase
Name:2-amino-4-hydroxy-6-hydroxymethyldihydropteridine pyrophosphokinase
Type:PROTEIN
Mol. Mass.:18075.55
Organism:Escherichia coli (strain K12)
Description:ChEMBL_108237
Residue:159
BDBM50181516
NameBDBM50181516
Synonyms:CHEMBL3819390
TypeSmall organic molecule
Emp. Form.C8H11N5O2S
Mol. Mass.241.27
SMILESNc1nc2[nH]c(SCCCO)nc2c(=O)[nH]1