Reaction Details
Target2-amino-4-hydroxy-6-hydroxymethyldihydropteridine diphosphokinase
LigandBDBM50181518
Substrate/Competitorn/a
Meas. Tech.ChEBML_1585631
Kd 2100±n/a nM
Citation Dennis, MLPitcher, NPLee, MDDeBono, AJWang, ZCHarjani, JRRahmani, RCleary, BPeat, TSBaell, JBSwarbrick, JD Structural Basis for the Selective Binding of Inhibitors to 6-Hydroxymethyl-7,8-dihydropterin Pyrophosphokinase from Staphylococcus aureus and Escherichia coli. J Med Chem59:5248-63 (2016) 
 
2-amino-4-hydroxy-6-hydroxymethyldihydropteridine diphosphokinase
Name:2-amino-4-hydroxy-6-hydroxymethyldihydropteridine diphosphokinase
Type:PROTEIN
Mol. Mass.:18024.64
Organism:Staphylococcus aureus
Description:ChEMBL_109736
Residue:158
BDBM50181518
NameBDBM50181518
Synonyms:CHEMBL3819092
TypeSmall organic molecule
Emp. Form.C13H9FN6OS
Mol. Mass.316.314
SMILESNc1nc2[nH]c(SCc3ccc(F)c(c3)C#N)nc2c(=O)[nH]1