Reaction Details
Target2-amino-4-hydroxy-6-hydroxymethyldihydropteridine diphosphokinase
LigandBDBM50181864
Substrate/Competitorn/a
Meas. Tech.ChEMBL_1585631 (CHEMBL3820450)
Kd 540±n/a nM
Citation Dennis, MLPitcher, NPLee, MDDeBono, AJWang, ZCHarjani, JRRahmani, RCleary, BPeat, TSBaell, JBSwarbrick, JD Structural Basis for the Selective Binding of Inhibitors to 6-Hydroxymethyl-7,8-dihydropterin Pyrophosphokinase from Staphylococcus aureus and Escherichia coli. J Med Chem59:5248-63 (2016) 
 
2-amino-4-hydroxy-6-hydroxymethyldihydropteridine diphosphokinase
Name:2-amino-4-hydroxy-6-hydroxymethyldihydropteridine diphosphokinase
Type:PROTEIN
Mol. Mass.:18024.64
Organism:Staphylococcus aureus
Description:ChEMBL_109736
Residue:158
BDBM50181864
NameBDBM50181864
Synonyms:CHEMBL3818368
TypeSmall organic molecule
Emp. Form.C12H10N6O3S
Mol. Mass.318.311
SMILESNc1nc2[nH]c(SCc3ccccc3[N+]([O-])=O)nc2c(=O)[nH]1