Reaction Details
TargetCarbonic anhydrase 6
LigandBDBM10880
Substrate/Competitorn/a
Meas. Tech.ChEMBL_1586605 (CHEMBL3821826)
Ki 11±n/a nM
Citation Mujumdar, PTeruya, KTonissen, KFVullo, DSupuran, CTPeat, TSPoulsen, SA An Unusual Natural Product Primary Sulfonamide: Synthesis, Carbonic Anhydrase Inhibition, and Protein X-ray Structures of Psammaplin C. J Med Chem59:5462-70 (2016) 
 
Carbonic anhydrase 6
Name:Carbonic anhydrase 6
Type:Enzyme
Mol. Mass.:35371.40
Organism:Homo sapiens (Human)
Description:P23280
Residue:308
BDBM10880
NameBDBM10880
Synonyms:AZA AZM acetazolamide Acetazolamide Acetazolamide (AZA) Acetazolamide, 5 Acetazolamide, AZA CHEMBL20 Sulfonamide, 1 US11278534, Example acetazolamide sulfonamide 1
TypeSmall organic molecule
Emp. Form.C4H6N4O3S2
Mol. Mass.222.245
SMILESCC(=O)Nc1nnc(s1)S(N)(=O)=O