Reaction Details
TargetEpidermal growth factor receptor
LigandBDBM50182493
Substrate/Competitorn/a
Meas. Tech.ChEBML_1586014
IC50>30000±n/a nM
Citation Zhao, JFang, LZhang, XLiang, YGou, S Synthesis and biological evaluation of new [1,2,4]triazolo[4,3-a]pyridine derivatives as potential c-Met inhibitors. Bioorg Med Chem24:3483-93 (2016) 
 
Epidermal growth factor receptor
Name:Epidermal growth factor receptor
Type:Receptor Kinase Domain
Mol. Mass.:134279.59
Organism:Homo sapiens (Human)
Description:P00533
Residue:1210
BDBM50182493
NameBDBM50182493
Synonyms:CHEMBL3818247 | US9512121, 22
TypeSmall organic molecule
Emp. Form.C22H16FN7O2S
Mol. Mass.461.472
SMILESCN1C(=O)COc2c1cnc1ccc(Sc3nnc4c(F)cc(cn34)-c3cnn(C)c3)cc21