Reaction Details
Target5-hydroxytryptamine receptor 2A
LigandBDBM50182748
Substrate/Competitorn/a
Meas. Tech.ChEMBL_1586509 (CHEMBL3821448)
Ki 3.9±n/a nM
Citation Ofori, EZhu, XYEtukala, JRPeprah, KJordan, KRAdkins, AABricker, BAKang, HJHuang, XPRoth, BLAblordeppey, SY Design and synthesis of dual 5-HT1A and 5-HT7 receptor ligands. Bioorg Med Chem24:3464-71 (2016) 
 
5-hydroxytryptamine receptor 2A
Name:5-hydroxytryptamine receptor 2A
Type:undefined
Mol. Mass.:52607.65
Organism:Homo sapiens (Human)
Description:P28223
Residue:471
BDBM50182748
NameBDBM50182748
Synonyms:CHEMBL3818989
TypeSmall organic molecule
Emp. Form.C19H21NO
Mol. Mass.279.3761
SMILESO=C(CCCN1CCc2ccccc2C1)c1ccccc1