Reaction Details
Target5-hydroxytryptamine receptor 7
LigandBDBM50051164
Substrate/Competitorn/a
Meas. Tech.ChEMBL_1586510 (CHEMBL3821449)
Ki 8.5±n/a nM
Citation Ofori, EZhu, XYEtukala, JRPeprah, KJordan, KRAdkins, AABricker, BAKang, HJHuang, XPRoth, BLAblordeppey, SY Design and synthesis of dual 5-HT1A and 5-HT7 receptor ligands. Bioorg Med Chem24:3464-71 (2016) 
 
5-hydroxytryptamine receptor 7
Name:5-hydroxytryptamine receptor 7
Type:G Protein-Coupled Receptor (GPCR)
Mol. Mass.:53573.08
Organism:Homo sapiens (Human)
Description:P34969
Residue:479
BDBM50051164
NameBDBM50051164
Synonyms:2-[4-(3,4-Dihydro-1H-isoquinolin-2-yl)-butyl]-isoindole-1,3-dione | CHEMBL273241
TypeSmall organic molecule
Emp. Form.C21H22N2O2
Mol. Mass.334.4116
SMILESO=C1N(CCCCN2CCc3ccccc3C2)C(=O)c2ccccc12