Reaction Details
TargetSodium-dependent noradrenaline transporter
LigandBDBM50098410
Substrate/Competitorn/a
Meas. Tech.ChEMBL_1586596 (CHEMBL3821817)
IC50 2.3±n/a nM
Citation Yukawa, TNakada, YSakauchi, NKamei, TYamada, MOhba, YFujimori, IUeno, HTakiguchi, MKuno, MKamo, INakagawa, HFujioka, YIgari, TIshichi, YTsukamoto, T Design, synthesis, and biological evaluation of a novel series of peripheral-selective noradrenaline reuptake inhibitors - Part 3. Bioorg Med Chem24:3716-26 (2016) 
 
Sodium-dependent noradrenaline transporter
Name:Sodium-dependent noradrenaline transporter
Type:Multi-pass membrane protein
Mol. Mass.:69337.72
Organism:Homo sapiens (Human)
Description:P23975
Residue:617
BDBM50098410
NameBDBM50098410
Synonyms:CHEMBL3593402
TypeSmall organic molecule
Emp. Form.C14H19Cl2FN2O2
Mol. Mass.337.217
SMILESCl.CC(=O)NC[C@@H]1CNCCO[C@H]1c1ccc(Cl)c(F)c1