Reaction Details
TargetSodium-dependent noradrenaline transporter
LigandBDBM50182762
Substrate/Competitorn/a
Meas. Tech.ChEMBL_1586596 (CHEMBL3821817)
IC50 0.640000±n/a nM
Citation Yukawa, TNakada, YSakauchi, NKamei, TYamada, MOhba, YFujimori, IUeno, HTakiguchi, MKuno, MKamo, INakagawa, HFujioka, YIgari, TIshichi, YTsukamoto, T Design, synthesis, and biological evaluation of a novel series of peripheral-selective noradrenaline reuptake inhibitors - Part 3. Bioorg Med Chem24:3716-26 (2016) 
 
Sodium-dependent noradrenaline transporter
Name:Sodium-dependent noradrenaline transporter
Type:Multi-pass membrane protein
Mol. Mass.:69337.72
Organism:Homo sapiens (Human)
Description:P23975
Residue:617
BDBM50182762
NameBDBM50182762
Synonyms:CHEMBL3818471
TypeSmall organic molecule
Emp. Form.C20H22Cl2FN5O2
Mol. Mass.454.325
SMILESCl.Cc1nnc([nH]1)-c1cccn(C[C@@H]2CNCCO[C@H]2c2ccc(Cl)c(F)c2)c1=O