Reaction Details
TargetSodium-dependent noradrenaline transporter
LigandBDBM50182791
Substrate/Competitorn/a
Meas. Tech.ChEMBL_1586596 (CHEMBL3821817)
IC50 25±n/a nM
Citation Yukawa, TNakada, YSakauchi, NKamei, TYamada, MOhba, YFujimori, IUeno, HTakiguchi, MKuno, MKamo, INakagawa, HFujioka, YIgari, TIshichi, YTsukamoto, T Design, synthesis, and biological evaluation of a novel series of peripheral-selective noradrenaline reuptake inhibitors - Part 3. Bioorg Med Chem24:3716-26 (2016) 
 
Sodium-dependent noradrenaline transporter
Name:Sodium-dependent noradrenaline transporter
Type:Multi-pass membrane protein
Mol. Mass.:69337.72
Organism:Homo sapiens (Human)
Description:P23975
Residue:617
BDBM50182791
NameBDBM50182791
Synonyms:CHEMBL3818596
TypeSmall organic molecule
Emp. Form.C19H19Cl2FN4O4
Mol. Mass.457.283
SMILESCl.Fc1cc(ccc1Cl)[C@@H]1OCCNC[C@H]1Cn1cc(ccc1=O)-c1noc(=O)[nH]1