Reaction Details
TargetTyrosine-protein phosphatase non-receptor type 2
LigandBDBM50183060
Substrate/Competitorn/a
Meas. Tech.ChEMBL_1586200 (CHEMBL3819915)
Ki 20±n/a nM
Citation Li, XWang, LShi, D The design strategy of selective PTP1B inhibitors over TCPTP. Bioorg Med Chem24:3343-52 (2016) 
 
Tyrosine-protein phosphatase non-receptor type 2
Name:Tyrosine-protein phosphatase non-receptor type 2
Type:Protein
Mol. Mass.:48481.80
Organism:Homo sapiens (Human)
Description:P17706
Residue:415
BDBM50183060
NameBDBM50183060
Synonyms:CHEMBL3818452
TypeSmall organic molecule
Emp. Form.C28H29F4N3O10P2
Mol. Mass.705.4851
SMILESNC(=O)[C@H](Cc1ccc(cc1)C(F)(F)P(O)(O)=O)NC(=O)[C@H](Cc1ccc(O)cc1)NC(=O)Cc1ccc(cc1)C(F)(F)P(O)(O)=O