Reaction Details
TargetNeurotensin receptor type 2
LigandBDBM50183341
Substrate/Competitorn/a
Meas. Tech.ChEMBL_1586259 (CHEMBL3820077)
EC50 3406±n/a nM
Citation Narayanan, SMaitra, RDeschamps, JRBortoff, KThomas, JBZhang, YWarner, KVasukuttan, VDecker, ARunyon, SP Discovery of a novel small molecule agonist scaffold for the APJ receptor. Bioorg Med Chem24:3758-70 (2016) 
 
Neurotensin receptor type 2
Name:Neurotensin receptor type 2
Type:PROTEIN
Mol. Mass.:46280.50
Organism:Rattus norvegicus
Description:ChEMBL_1466615
Residue:416
BDBM50183341
NameBDBM50183341
Synonyms:CHEMBL3817879
TypeSmall organic molecule
Emp. Form.C29H34FN3O5
Mol. Mass.523.5958
SMILESCOc1cccc(OC)c1-c1cc(nn1-c1ccc(F)cc1)C(=O)N[C@@H](CCC1CCCCC1)CC(O)=O