Reaction Details
TargetEpidermal growth factor receptor
LigandBDBM50183391
Substrate/Competitorn/a
Meas. Tech.ChEMBL_1586270 (CHEMBL3820192)
IC50 5.5±n/a nM
Citation Shao, JChen, EShu, KChen, WZhang, GYu, Y 6-Oxooxazolidine-quinazolines as noncovalent inhibitors with the potential to target mutant forms of EGFR. Bioorg Med Chem24:3359-70 (2016) 
 
Epidermal growth factor receptor
Name:Epidermal growth factor receptor
Type:Receptor Kinase Domain
Mol. Mass.:134279.59
Organism:Homo sapiens (Human)
Description:P00533
Residue:1210
BDBM50183391
NameBDBM50183391
Synonyms:CHEMBL3818563
TypeSmall organic molecule
Emp. Form.C22H23N5O4
Mol. Mass.421.4491
SMILESCCOc1cc2ncnc(N[C@@H](C)c3ccccc3)c2cc1NC(=O)[C@@H]1COC(=O)N1