Reaction Details
TargetSerine/threonine-protein kinase mTOR
LigandBDBM25116
Substrate/Competitorn/a
Meas. Tech.ChEMBL_1587938 (CHEMBL3826741)
IC50 9318±n/a nM
Citation Fraser, CDawson, JCDowling, RHouston, DRWeiss, JTMunro, AFMuir, MHarrington, LWebster, SPFrame, MCBrunton, VGPatton, EECarragher, NOUnciti-Broceta, A Rapid Discovery and Structure-Activity Relationships of Pyrazolopyrimidines That Potently Suppress Breast Cancer Cell Growth via SRC Kinase Inhibition with Exceptional Selectivity over ABL Kinase. J Med Chem59:4697-710 (2016) 
 
Serine/threonine-protein kinase mTOR
Name:Serine/threonine-protein kinase mTOR
Type:Rapamycin target protein
Mol. Mass.:288917.12
Organism:Homo sapiens (Human)
Description:P42345
Residue:2549
BDBM25116
NameBDBM25116
Synonyms:1-tert-butyl-3-(4-methylphenyl)-1H-pyrazolo[3,4-d]pyrimidin-4-amine PP1 US10807986, Comparative compound 1 US11701353, PP1 (Pfizer) | cid_1400
TypeSmall organic molecule
Emp. Form.C16H19N5
Mol. Mass.281.3556
SMILESCc1ccc(cc1)-c1nn(c2ncnc(N)c12)C(C)(C)C