Reaction Details
TargetPlatelet-derived growth factor receptor alpha
LigandBDBM50184774
Substrate/Competitorn/a
Meas. Tech.ChEMBL_1587939 (CHEMBL3826742)
IC50>10000±n/a nM
Citation Fraser, CDawson, JCDowling, RHouston, DRWeiss, JTMunro, AFMuir, MHarrington, LWebster, SPFrame, MCBrunton, VGPatton, EECarragher, NOUnciti-Broceta, A Rapid Discovery and Structure-Activity Relationships of Pyrazolopyrimidines That Potently Suppress Breast Cancer Cell Growth via SRC Kinase Inhibition with Exceptional Selectivity over ABL Kinase. J Med Chem59:4697-710 (2016) 
 
Platelet-derived growth factor receptor alpha
Name:Platelet-derived growth factor receptor alpha
Type:Protein
Mol. Mass.:122633.38
Organism:Homo sapiens (Human)
Description:P16234
Residue:1089
BDBM50184774
NameBDBM50184774
Synonyms:CHEMBL3799221
TypeSmall organic molecule
Emp. Form.C18H21N7O2
Mol. Mass.367.405
SMILESCCOC(Cn1nc(-c2cnc3[nH]ccc3c2)c2c(N)ncnc12)OCC