Reaction Details
TargetPlatelet-derived growth factor receptor alpha
LigandBDBM13216
Substrate/Competitorn/a
Meas. Tech.ChEMBL_1587939 (CHEMBL3826742)
IC50 9.9±n/a nM
Citation Fraser, CDawson, JCDowling, RHouston, DRWeiss, JTMunro, AFMuir, MHarrington, LWebster, SPFrame, MCBrunton, VGPatton, EECarragher, NOUnciti-Broceta, A Rapid Discovery and Structure-Activity Relationships of Pyrazolopyrimidines That Potently Suppress Breast Cancer Cell Growth via SRC Kinase Inhibition with Exceptional Selectivity over ABL Kinase. J Med Chem59:4697-710 (2016) 
 
Platelet-derived growth factor receptor alpha
Name:Platelet-derived growth factor receptor alpha
Type:Protein
Mol. Mass.:122633.38
Organism:Homo sapiens (Human)
Description:P16234
Residue:1089
BDBM13216
NameBDBM13216
Synonyms:BMS-354825 DASATINIB N-(2-chloro-6-methylphenyl)-2-({6-[4-(2-hydroxyethyl)piperazin-1-yl]-2-methylpyrimidin-4-yl}amino)-1,3-thiazole-5-carboxamide US20230348453, Compound A8 med.21724, Compound Dasatinib
TypeSmall organic molecule
Emp. Form.C22H26ClN7O2S
Mol. Mass.488.006
SMILESCc1nc(Nc2ncc(s2)C(=O)Nc2c(C)cccc2Cl)cc(n1)N1CCN(CCO)CC1