Reaction Details
TargetProto-oncogene tyrosine-protein kinase receptor Ret
LigandBDBM50184774
Substrate/Competitorn/a
Meas. Tech.ChEMBL_1587940 (CHEMBL3826743)
IC50 598±n/a nM
Citation Fraser, CDawson, JCDowling, RHouston, DRWeiss, JTMunro, AFMuir, MHarrington, LWebster, SPFrame, MCBrunton, VGPatton, EECarragher, NOUnciti-Broceta, A Rapid Discovery and Structure-Activity Relationships of Pyrazolopyrimidines That Potently Suppress Breast Cancer Cell Growth via SRC Kinase Inhibition with Exceptional Selectivity over ABL Kinase. J Med Chem59:4697-710 (2016) 
 
Proto-oncogene tyrosine-protein kinase receptor Ret
Name:Proto-oncogene tyrosine-protein kinase receptor Ret
Type:Protein
Mol. Mass.:124318.29
Organism:Homo sapiens (Human)
Description:P07949
Residue:1114
BDBM50184774
NameBDBM50184774
Synonyms:CHEMBL3799221
TypeSmall organic molecule
Emp. Form.C18H21N7O2
Mol. Mass.367.405
SMILESCCOC(Cn1nc(-c2cnc3[nH]ccc3c2)c2c(N)ncnc12)OCC