Reaction Details
TargetProto-oncogene tyrosine-protein kinase receptor Ret
LigandBDBM50184766
Substrate/Competitorn/a
Meas. Tech.ChEMBL_1587940 (CHEMBL3826743)
IC50 289±n/a nM
Citation Fraser, CDawson, JCDowling, RHouston, DRWeiss, JTMunro, AFMuir, MHarrington, LWebster, SPFrame, MCBrunton, VGPatton, EECarragher, NOUnciti-Broceta, A Rapid Discovery and Structure-Activity Relationships of Pyrazolopyrimidines That Potently Suppress Breast Cancer Cell Growth via SRC Kinase Inhibition with Exceptional Selectivity over ABL Kinase. J Med Chem59:4697-710 (2016) 
 
Proto-oncogene tyrosine-protein kinase receptor Ret
Name:Proto-oncogene tyrosine-protein kinase receptor Ret
Type:Protein
Mol. Mass.:124318.29
Organism:Homo sapiens (Human)
Description:P07949
Residue:1114
BDBM50184766
NameBDBM50184766
Synonyms:CHEMBL3823861 | US10294227, Code 221
TypeSmall organic molecule
Emp. Form.C22H29N9
Mol. Mass.419.526
SMILESCN(C)CC1CCN(CCn2nc(-c3cnc4[nH]ccc4c3)c3c(N)ncnc23)CC1