Reaction Details
TargetHeat shock cognate 71 kDa protein
LigandBDBM32373
Substrate/Competitorn/a
Meas. Tech.ChEMBL_1588265 (CHEMBL3825930)
Kd 3500±n/a nM
Citation Cheeseman, MDWestwood, IMBarbeau, ORowlands, MDobson, SJones, AMJeganathan, FBurke, RKadi, NWorkman, PCollins, Ivan Montfort, RLJones, K Exploiting Protein Conformational Change to Optimize Adenosine-Derived Inhibitors of HSP70. J Med Chem59:4625-36 (2016) 
 
Heat shock cognate 71 kDa protein
Name:Heat shock cognate 71 kDa protein
Type:Enzyme Catalytic Domain
Mol. Mass.:70887.67
Organism:Homo sapiens (Human)
Description:gi_5729877
Residue:646
BDBM32373
NameBDBM32373
Synonyms:adenosine-derived inhibitor (Grp78), 8 | adenosine-derived inhibitor, 7
TypeSmall organic molecule
Emp. Form.C17H18Cl2N6O4
Mol. Mass.441.269
SMILESNc1ncnc2n([C@@H]3O[C@H](CO)[C@@H](O)[C@H]3O)c(NCc3ccc(Cl)c(Cl)c3)nc12