Reaction Details
TargetDual specificity protein kinase CLK1
LigandBDBM50185005
Substrate/Competitorn/a
Meas. Tech.ChEMBL_1588977 (CHEMBL3825018)
IC50 41±n/a nM
Citation Esvan, YJZeinyeh, WBoibessot, TNauton, LThéry, VKnapp, SChaikuad, ALoaëc, NMeijer, LAnizon, FGiraud, FMoreau, P Discovery of pyrido[3,4-g]quinazoline derivatives as CMGC family protein kinase inhibitors: Design, synthesis, inhibitory potency and X-ray co-crystal structure. Eur J Med Chem118:170-7 (2016) 
 
Dual specificity protein kinase CLK1
Name:Dual specificity protein kinase CLK1
Type:Protein
Mol. Mass.:57322.21
Organism:Homo sapiens (Human)
Description:P49759
Residue:484
BDBM50185005
NameBDBM50185005
Synonyms:CHEMBL3823483
TypeSmall organic molecule
Emp. Form.C11H9N5
Mol. Mass.211.2227
SMILESNc1ncc2cc3cnccc3c(N)c2n1