Reaction Details
TargetUrotensin-2 receptor
LigandBDBM50185129
Substrate/Competitorn/a
Meas. Tech.ChEMBL_1587394 (CHEMBL3824512)
EC50 13±n/a nM
Citation Merlino, FYousif, AMBillard, ÉDufour-Gallant, JTurcotte, SGrieco, PChatenet, DLubell, WD Urotensin II((4-11)) Azasulfuryl Peptides: Synthesis and Biological Activity. J Med Chem59:4740-52 (2016) 
 
Urotensin-2 receptor
Name:Urotensin-2 receptor
Type:Enzyme Catalytic Domain
Mol. Mass.:42725.34
Organism:RAT
Description:Urotensin-II UTS2R RAT::P49684
Residue:386
BDBM50185129
NameBDBM50185129
Synonyms:CHEMBL3822808
TypeSmall organic molecule
Emp. Form.C52H66N10O13S3
Mol. Mass.1135.335
SMILESCC(C)[C@H](NC(=O)[C@@H]1CSSC[C@H](NC(=O)[C@@H](N)CC(O)=O)C(=O)N[C@@H](Cc2ccccc2)C(=O)NN(Cc2ccc(cc2)-c2ccccc2)S(=O)(=O)N[C@@H](CCCCN)C(=O)N[C@@H](Cc2ccc(O)cc2)C(=O)N1)C(O)=O