Reaction Details
TargetUrotensin-2 receptor
LigandBDBM50185137
Substrate/Competitorn/a
Meas. Tech.ChEMBL_1587394 (CHEMBL3824512)
EC50 9.1±n/a nM
Citation Merlino, FYousif, AMBillard, ÉDufour-Gallant, JTurcotte, SGrieco, PChatenet, DLubell, WD Urotensin II((4-11)) Azasulfuryl Peptides: Synthesis and Biological Activity. J Med Chem59:4740-52 (2016) 
 
Urotensin-2 receptor
Name:Urotensin-2 receptor
Type:Enzyme Catalytic Domain
Mol. Mass.:42725.34
Organism:RAT
Description:Urotensin-II UTS2R RAT::P49684
Residue:386
BDBM50185137
NameBDBM50185137
Synonyms:CHEMBL3823569
TypeSmall organic molecule
Emp. Form.C48H63N11O13S3
Mol. Mass.1098.275
SMILESCC(C)[C@H](NC(=O)[C@@H]1CSSC[C@H](NC(=O)[C@@H](N)CC(O)=O)C(=O)N[C@@H](Cc2ccccc2)C(=O)N[C@@H](Cc2c[nH]c3ccccc23)C(=O)NN(CCCCN)S(=O)(=O)N[C@@H](Cc2ccc(O)cc2)C(=O)N1)C(O)=O