Reaction Details
TargetMu-type opioid receptor
LigandBDBM50185325
Substrate/Competitorn/a
Meas. Tech.ChEMBL_1587704 (CHEMBL3825884)
Ki 4.4±n/a nM
Citation Harland, AABender, AMGriggs, NWGao, CAnand, JPPogozheva, IDTraynor, JRJutkiewicz, EMMosberg, HI Effects of N-Substitutions on the Tetrahydroquinoline (THQ) Core of Mixed-Efficacyµ-Opioid Receptor (MOR)/d-Opioid Receptor (DOR) Ligands. J Med Chem59:4985-98 (2016) 
 
Mu-type opioid receptor
Name:Mu-type opioid receptor
Type:G Protein-Coupled Receptor (GPCR)
Mol. Mass.:44503.11
Organism:Rattus norvegicus (rat)
Description:Competition binding assays were carried out using membrane preparations from transfected HN9.10 cells that constitutively expressed the mu opioid receptor.
Residue:398
BDBM50185325
NameBDBM50185325
Synonyms:CHEMBL3824013
TypeSmall organic molecule
Emp. Form.C29H33N3O4
Mol. Mass.487.59
SMILESCc1cc(O)cc(C)c1C[C@H](N)C(=O)N[C@@H]1CCN(CC(O)=O)c2ccc(Cc3ccccc3)cc12