Reaction Details
TargetDelta-type opioid receptor
LigandBDBM50185326
Substrate/Competitorn/a
Meas. Tech.ChEMBL_1587705 (CHEMBL3825885)
Ki 0.210000±n/a nM
Citation Harland, AABender, AMGriggs, NWGao, CAnand, JPPogozheva, IDTraynor, JRJutkiewicz, EMMosberg, HI Effects of N-Substitutions on the Tetrahydroquinoline (THQ) Core of Mixed-Efficacyµ-Opioid Receptor (MOR)/d-Opioid Receptor (DOR) Ligands. J Med Chem59:4985-98 (2016) 
 
Delta-type opioid receptor
Name:Delta-type opioid receptor
Type:G Protein-Coupled Receptor (GPCR)
Mol. Mass.:40465.04
Organism:Rattus norvegicus (rat)
Description:Competition binding assays were using CHO-K1 cell membranes expressing the opioid receptor.
Residue:372
BDBM50185326
NameBDBM50185326
Synonyms:CHEMBL3823186
TypeSmall organic molecule
Emp. Form.C34H37N3O3
Mol. Mass.535.6759
SMILESCCC(=O)N1CC[C@@H](NC(=O)[C@@H](N)Cc2c(C)cc(O)cc2C)c2cc(Cc3ccc4ccccc4c3)ccc12