Reaction Details
TargetKappa-type opioid receptor
LigandBDBM50185311
Substrate/Competitorn/a
Meas. Tech.ChEMBL_1587706 (CHEMBL3825886)
Ki 25±n/a nM
Citation Harland, AABender, AMGriggs, NWGao, CAnand, JPPogozheva, IDTraynor, JRJutkiewicz, EMMosberg, HI Effects of N-Substitutions on the Tetrahydroquinoline (THQ) Core of Mixed-Efficacyµ-Opioid Receptor (MOR)/d-Opioid Receptor (DOR) Ligands. J Med Chem59:4985-98 (2016) 
 
Kappa-type opioid receptor
Name:Kappa-type opioid receptor
Type:G Protein-Coupled Receptor (GPCR)
Mol. Mass.:42648.76
Organism:Homo sapiens (Human)
Description:P41145
Residue:380
BDBM50185311
NameBDBM50185311
Synonyms:CHEMBL3823231
TypeSmall organic molecule
Emp. Form.C31H35N3O3
Mol. Mass.497.6279
SMILESCc1cc(O)cc(C)c1C[C@H](N)C(=O)N[C@@H]1CCN(C(=O)C2CC2)c2ccc(Cc3ccccc3)cc12