Reaction Details
TargetDelta-type opioid receptor
LigandBDBM50185312
Substrate/Competitorn/a
Meas. Tech.ChEMBL_1587711 (CHEMBL3825891)
EC50 5.1±n/a nM
Citation Harland, AABender, AMGriggs, NWGao, CAnand, JPPogozheva, IDTraynor, JRJutkiewicz, EMMosberg, HI Effects of N-Substitutions on the Tetrahydroquinoline (THQ) Core of Mixed-Efficacyµ-Opioid Receptor (MOR)/d-Opioid Receptor (DOR) Ligands. J Med Chem59:4985-98 (2016) 
 
Delta-type opioid receptor
Name:Delta-type opioid receptor
Type:G Protein-Coupled Receptor (GPCR)
Mol. Mass.:40465.04
Organism:Rattus norvegicus (rat)
Description:Competition binding assays were using CHO-K1 cell membranes expressing the opioid receptor.
Residue:372
BDBM50185312
NameBDBM50185312
Synonyms:CHEMBL3823787
TypeSmall organic molecule
Emp. Form.C32H37N3O3
Mol. Mass.511.6545
SMILESCc1cc(O)cc(C)c1C[C@H](N)C(=O)N[C@@H]1CCN(C(=O)C2CCC2)c2ccc(Cc3ccccc3)cc12