Reaction Details
TargetCysteine protease
LigandBDBM50322349
Substrate/Competitorn/a
Meas. Tech.ChEMBL_1587357 (CHEMBL3826522)
Ki 2.6±n/a nM
Citation Ettari, RPreviti, SCosconati, SMaiorana, SSchirmeister, TGrasso, SZappalą, M Development of novel 1,4-benzodiazepine-based Michael acceptors as antitrypanosomal agents. Bioorg Med Chem Lett26:3453-6 (2016) 
 
Cysteine protease
Name:Cysteine protease
Synonyms:Rhodesain
Type:PROTEIN
Mol. Mass.:48425.78
Organism:Trypanosoma brucei rhodesiense
Description:ChEMBL_619861
Residue:450
BDBM50322349
NameBDBM50322349
TypeSmall organic molecule
Emp. Form.C34H38N4O6
Mol. Mass.598.6887
SMILESCOC(=O)\C=C\CNC(=O)CN1c2ccccc2C(=N[C@H](COC(=O)NC23CC4CC(CC(C4)C2)C3)C1=O)c1ccccc1