Reaction Details
TargetCholinesterase
LigandBDBM8961
Substrate/Competitorn/a
Meas. Tech.ChEMBL_1587904 (CHEMBL3826565)
IC50 30±n/a nM
Citation Wang, JWang, ZMLi, XMLi, FWu, JJKong, LYWang, XB Synthesis and evaluation of multi-target-directed ligands for the treatment of Alzheimer's disease based on the fusion of donepezil and melatonin. Bioorg Med Chem24:4324-4338 (2016) 
 
Cholinesterase
Name:Cholinesterase
Type:Homotetramer
Mol. Mass.:68422.27
Organism:Homo sapiens (Human)
Description:P06276
Residue:602
BDBM8961
NameBDBM8961
Synonyms:1,2,3,4-tetrahydro-9-acridinamine 9-THA CHEMBL1337960 Cognex Tracine cid_1935 | tacrine.HCl
TypeSmall organic molecule
Emp. Form.C13H14N2
Mol. Mass.198.2637
SMILESNc1c2CCCCc2nc2ccccc12