Reaction Details
TargetHistone-lysine N-methyltransferase SETD7
LigandBDBM50187207
Substrate/Competitorn/a
Meas. Tech.ChEMBL_1589562 (CHEMBL3829237)
IC50>100000±n/a nM
Citation Fujiwara, TOhira, KUrushibara, KIto, AYoshida, MKanai, MTanatani, AKagechika, HHirano, T Steric structure-activity relationship of cyproheptadine derivatives as inhibitors of histone methyltransferase Set7/9. Bioorg Med Chem24:4318-4323 (2016) 
 
Histone-lysine N-methyltransferase SETD7
Name:Histone-lysine N-methyltransferase SETD7
Type:Enzyme
Mol. Mass.:40691.12
Organism:Homo sapiens (Human)
Description:Q8WTS6
Residue:366
BDBM50187207
NameBDBM50187207
Synonyms:CHEMBL3827431
TypeSmall organic molecule
Emp. Form.C19H21NOS
Mol. Mass.311.441
SMILESCN1CCC(CC1)OC1c2ccccc2Sc2ccccc12