Reaction Details
TargetHistone-lysine N-methyltransferase SETD7
LigandBDBM50187212
Substrate/Competitorn/a
Meas. Tech.ChEMBL_1589562 (CHEMBL3829237)
IC50>100000±n/a nM
Citation Fujiwara, TOhira, KUrushibara, KIto, AYoshida, MKanai, MTanatani, AKagechika, HHirano, T Steric structure-activity relationship of cyproheptadine derivatives as inhibitors of histone methyltransferase Set7/9. Bioorg Med Chem24:4318-4323 (2016) 
 
Histone-lysine N-methyltransferase SETD7
Name:Histone-lysine N-methyltransferase SETD7
Type:Enzyme
Mol. Mass.:40691.12
Organism:Homo sapiens (Human)
Description:Q8WTS6
Residue:366
BDBM50187212
NameBDBM50187212
Synonyms:CHEMBL3828393
TypeSmall organic molecule
Emp. Form.C20H22N2
Mol. Mass.290.4021
SMILESCN1CCN(CC1)C1c2ccccc2C=Cc2ccccc12