Reaction Details
TargetHistone-lysine N-methyltransferase SETD7
LigandBDBM50097224
Substrate/Competitorn/a
Meas. Tech.ChEMBL_1589562 (CHEMBL3829237)
IC50 4300±n/a nM
Citation Fujiwara, TOhira, KUrushibara, KIto, AYoshida, MKanai, MTanatani, AKagechika, HHirano, T Steric structure-activity relationship of cyproheptadine derivatives as inhibitors of histone methyltransferase Set7/9. Bioorg Med Chem24:4318-4323 (2016) 
 
Histone-lysine N-methyltransferase SETD7
Name:Histone-lysine N-methyltransferase SETD7
Type:Enzyme
Mol. Mass.:40691.12
Organism:Homo sapiens (Human)
Description:Q8WTS6
Residue:366
BDBM50097224
NameBDBM50097224
Synonyms:1-Methyl-4-thioxanthen-9-ylidene-piperidine CHEMBL152408 | Pimethixene
TypeSmall organic molecule
Emp. Form.C19H19NS
Mol. Mass.293.426
SMILES[#6]-[#7]-1-[#6]-[#6]\[#6](-[#6]-[#6]-1)=[#6]-1\c2ccccc2-[#16]-c2ccccc-12