Reaction Details
TargetPolyphenol oxidase 2
LigandBDBM50187504
Substrate/Competitorn/a
Meas. Tech.ChEMBL_1590348 (CHEMBL3830496)
IC50 9310±n/a nM
Citation Garcia-Jimenez, ATeruel-Puche, JABerna, JRodriguez-Lopez, JNTudela, JGarcia-Ruiz, PAGarcia-Canovas, F Characterization of the action of tyrosinase on resorcinols. Bioorg Med Chem24:4434-4443 (2016) 
 
Polyphenol oxidase 2
Name:Polyphenol oxidase 2
Type:Protein
Mol. Mass.:63923.66
Organism:Agaricus bisporus (Common mushroom)
Description:O42713
Residue:556
BDBM50187504
NameBDBM50187504
Synonyms:CHEMBL3828450
TypeSmall organic molecule
Emp. Form.C7H8O2
Mol. Mass.124.1372
SMILESCc1ccc(O)cc1O