Reaction Details
TargetPolyphenol oxidase 2
LigandBDBM50187503
Substrate/Competitorn/a
Meas. Tech.ChEMBL_1590349 (CHEMBL3830497)
IC50 717000±n/a nM
Citation Garcia-Jimenez, ATeruel-Puche, JABerna, JRodriguez-Lopez, JNTudela, JGarcia-Ruiz, PAGarcia-Canovas, F Characterization of the action of tyrosinase on resorcinols. Bioorg Med Chem24:4434-4443 (2016) 
 
Polyphenol oxidase 2
Name:Polyphenol oxidase 2
Type:Protein
Mol. Mass.:63923.66
Organism:Agaricus bisporus (Common mushroom)
Description:O42713
Residue:556
BDBM50187503
NameBDBM50187503
Synonyms:2-Methylresorcinol | CHEMBL2332773
TypeSmall organic molecule
Emp. Form.C7H8O2
Mol. Mass.124.1372
SMILESCc1c(O)cccc1O