Reaction Details
TargetEctonucleoside triphosphate diphosphohydrolase 2
LigandBDBM50187685
Substrate/Competitorn/a
Meas. Tech.ChEMBL_1590660 (CHEMBL3829421)
IC50 3000±n/a nM
Citation Fiene, ABaqi, YMalik, EMNewton, PLi, WLee, SYHartland, ELMüller, CE Inhibitors for the bacterial ectonucleotidase Lp1NTPDase from Legionella pneumophila. Bioorg Med Chem24:4363-4371 (2016) 
 
Ectonucleoside triphosphate diphosphohydrolase 2
Name:Ectonucleoside triphosphate diphosphohydrolase 2
Type:PROTEIN
Mol. Mass.:53675.44
Organism:Homo sapiens (Human)
Description:ChEMBL_1453714
Residue:495
BDBM50187685
NameBDBM50187685
Synonyms:CHEMBL597418
TypeSmall organic molecule
Emp. Form.C28H17N2NaO5S
Mol. Mass.516.5
SMILES[Na+].Nc1c2C(=O)c3ccccc3C(=O)c2c(Nc2cc3ccccc3c3ccccc23)cc1S([O-])(=O)=O