Reaction Details
TargetEctonucleotide pyrophosphatase/phosphodiesterase family member 2
LigandBDBM50187694
Substrate/Competitorn/a
Meas. Tech.ChEMBL_1591118 (CHEMBL3829086)
Ki 280±n/a nM
Citation Castagna, DBudd, DCMacdonald, SJJamieson, CWatson, AJ Development of Autotaxin Inhibitors: An Overview of the Patent and Primary Literature. J Med Chem59:5604-21 (2016) 
 
Ectonucleotide pyrophosphatase/phosphodiesterase family member 2
Name:Ectonucleotide pyrophosphatase/phosphodiesterase family member 2
Type:Enzyme
Mol. Mass.:99007.13
Organism:Homo sapiens (Human)
Description:Q13822
Residue:863
BDBM50187694
NameBDBM50187694
Synonyms:CHEMBL3828165
TypeSmall organic molecule
Emp. Form.C21H37O3P
Mol. Mass.368.4904
c1ccc(CP(O)(O)=O)cc1