Reaction Details
TargetEctonucleotide pyrophosphatase/phosphodiesterase family member 2
LigandBDBM50187687
Substrate/Competitorn/a
Meas. Tech.ChEMBL_1591234 (CHEMBL3829626)
IC50 31±n/a nM
Citation Castagna, DBudd, DCMacdonald, SJJamieson, CWatson, AJ Development of Autotaxin Inhibitors: An Overview of the Patent and Primary Literature. J Med Chem59:5604-21 (2016) 
 
Ectonucleotide pyrophosphatase/phosphodiesterase family member 2
Name:Ectonucleotide pyrophosphatase/phosphodiesterase family member 2
Type:Enzyme
Mol. Mass.:99007.13
Organism:Homo sapiens (Human)
Description:Q13822
Residue:863
BDBM50187687
NameBDBM50187687
Synonyms:CHEMBL3828733 | US11124490, Compound 918013
TypeSmall organic molecule
Emp. Form.C17H15Cl2FN2O4S
Mol. Mass.433.281
SMILESFc1cccc(NC(=O)c2cc(c(Cl)cc2Cl)S(=O)(=O)N2CCOCC2)c1