Reaction Details
TargetAromatase
LigandBDBM92557
Substrate/Competitorn/a
Meas. Tech.ChEMBL_1589888 (CHEMBL3830768)
IC50 12100±n/a nM
Citation Dandriyal, JSingla, RKumar, MJaitak, V Recent developments of C-4 substituted coumarin derivatives as anticancer agents. Eur J Med Chem119:141-68 (2016) 
 
Aromatase
Name:Aromatase
Type:Enzyme
Mol. Mass.:57888.92
Organism:Homo sapiens (Human)
Description:P11511
Residue:503
BDBM92557
NameBDBM92557
Synonyms:Neoflavonoid, 9
TypeSmall organic molecule
Emp. Form.C20H18O8
Mol. Mass.386.3521
SMILESCOc1cc(cc(OC)c1OC(C)=O)C1CC(=O)Oc2cc3OCOc3cc12